{"text_format":"1","workbook":"xlsx","n_sheets":2,"sheets":["Input","Printable Sheet"],"not_rendered":{"charts":0,"images":1,"macros":1,"external_links":0,"defined_names":2,"comments":0,"pivot_tables":0},"unopened":[],"bounds":{"document_bytes":16777216,"sheet_cells":100000,"rows_first":2000,"rows_last":500,"rows_between":2000,"halvings":0,"cell_chars":16384,"cell_head_chars":4096},"cells_cut":0,"cells_raw":0,"read":"whole","date_system":"1900"}

{"sheet":"Input","index":0,"n_rows":54,"n_cols":15,"rows_kept":54,"cut":false,"hidden":false,"merged":[[0,0,0,9]]}
["The 15 Minute Fix: SENSES - Workout Generator\nTo generate a printable weekly workout tracking/planning sheet, choose exercises from the drop down menus available in column B, input the number of times you want to do an exercise per day (usually just 1), and select \"yes\" under the days of the week on which you would like to do that exercise. The first three rows are filled out with sample exercises, but you can change those to any exercises you want. Once complete, click on the \"Printable Sheet\" tab at the bottom, add a title and date to your workout if you wish, and print the page. It should auto-adjust so that you see all of your exercises with no extra rows. The features in this worksheet are designed for Microsoft Excel. Spreadsheet contents copyright © 2014 John Parker. All rights reserved."]
["#","Exercise","Times/Day","Sun","Mon","Tue","Wed","Thus","Fri","Sat"]
[{"$f":"IF(B3=0,\"\",VLOOKUP(B3,$L$3:$M$54,2,FALSE))","v":1},"5x5 Warm Up",1,null,"yes",null,"yes",null,"yes",null,null,"5x5 Warm Up",1,3,"yes"]
[{"$f":"IF(B4=0,\"\",VLOOKUP(B4,$L$3:$M$54,2,FALSE))","v":3},"Elementary Listening",1,null,null,"yes",null,"yes",null,null,null,"Ear Accupressure",2,2,"no"]
[17,"Distinct Smell Awareness",1,"yes",null,null,"yes",null,null,"yes",null,"Elementary Listening",3,3]
[25,"Taste Comprehension",1,null,"yes",null,"yes",null,"yes",null,null,"One More Sound",4,3]
[35,"Hand Exploration",1,null,null,"yes",null,"yes",null,null,null,"Hear and There",5,1]
["",null,1,null,null,null,null,null,null,null,null,"Music Exploration",6,4]
["",null,1,null,null,null,null,null,null,null,null,"Polly Want a Cracker?",7,4]
["",null,1,null,null,null,null,null,null,null,null,"Copycat",8,3]
["",null,1,null,null,null,null,null,null,null,null,"Cocktail Party Practice",9,4]
["",null,1,null,null,null,null,null,null,null,null,"Directional Locating",10,4]
["",null,1,null,null,null,null,null,null,null,null,"Clap Away",11,4]
["",null,1,null,null,null,null,null,null,null,null,"Broken Listening",12,4]
["",null,1,null,null,null,null,null,null,null,null,"Low Volume",13,5]
["",null,1,null,null,null,null,null,null,null,null,"Peripheral Hearing",14,0]
["",null,1,null,null,null,null,null,null,null,null,"Sniffing",15,3]
["",null,1,null,null,null,null,null,null,null,null,"Coffee Sniffing",16,0.5]
["",null,1,null,null,null,null,null,null,null,null,"Distinct Smell Awareness",17,2]
["",null,1,null,null,null,null,null,null,null,null,"Indistinct Smell Awareness",18,2]
["",null,1,null,null,null,null,null,null,null,null,"Spice ID",19,5]
["",null,1,null,null,null,null,null,null,null,null,"Distinct Smell Exploration",20,0]
["",null,1,null,null,null,null,null,null,null,null,"Smelling Chef",21,0]
["",null,1,null,null,null,null,null,null,null,null,"Slurping",22,0]
["",null,1,null,null,null,null,null,null,null,null,"Salivation",23,2]
["",null,1,null,null,null,null,null,null,null,null,"Mouth Stretch",24,2]
["",null,1,null,null,null,null,null,null,null,null,"Taste Comprehension",25,2]
["",null,1,null,null,null,null,null,null,null,null,"Exercise While You Eat",26,0]
["",null,1,null,null,null,null,null,null,null,null,"What's the Difference?",27,3]
["",null,1,null,null,null,null,null,null,null,null,"Finger Taps",28,3]
["",null,1,null,null,null,null,null,null,null,null,"Head To Toe Taps",29,2]
["",null,1,null,null,null,null,null,null,null,null,"Hot & Cold Touch",30,3]
["",null,1,null,null,null,null,null,null,null,null,"Visible Ten Finger Touch",31,3]
["",null,1,null,null,null,null,null,null,null,null,"Blind Ten Finger Touch",32,3]
["",null,1,null,null,null,null,null,null,null,null,"Feel the Dice",33,3]
["",null,1,null,null,null,null,null,null,null,null,"Multi-Touch",34,2]
["",null,1,null,null,null,null,null,null,null,null,"Hand Exploration",35,4]
["",null,1,null,null,null,null,null,null,null,null,"Barefoot Walk",36,4]
["",null,1,null,null,null,null,null,null,null,null,"Weighty Decisions",37,3]
["",null,1,null,null,null,null,null,null,null,null,"Sculpting",38,3]
{"$rows_left_out":15}
{"sheet":"Printable Sheet","index":1,"n_rows":149,"n_cols":21,"rows_kept":149,"cut":false,"hidden":false,"merged":[[140,0,142,0],[140,1,142,1],[140,2,142,2],[143,0,145,0],[143,1,145,1],[143,2,145,2],[134,0,136,0],[134,1,136,1],[134,2,136,2],[137,0,139,0],[137,1,139,1],[137,2,139,2],[128,0,130,0],[128,1,130,1],[128,2,130,2],[131,0,133,0],[131,1,133,1],[131,2,133,2],[122,0,124,0],[122,1,124,1],[122,2,124,2],[125,0,127,0],[125,1,127,1],[125,2,127,2],[116,0,118,0],[116,1,118,1],[116,2,118,2],[119,0,121,0],[119,1,121,1],[119,2,121,2],[110,0,112,0],[110,1,112,1],[110,2,112,2],[113,0,115,0],[113,1,115,1],[113,2,115,2],[104,0,106,0],[104,1,106,1],[104,2,106,2],[107,0,109,0],[107,1,109,1],[107,2,109,2],[98,0,100,0],[98,1,100,1],[98,2,100,2],[101,0,103,0],[101,1,103,1],[101,2,103,2],[92,0,94,0],[92,1,94,1],[92,2,94,2],[95,0,97,0],[95,1,97,1],[95,2,97,2],[86,0,88,0],[86,1,88,1],[86,2,88,2],[89,0,91,0],[89,1,91,1],[89,2,91,2],[80,0,82,0],[80,1,82,1],[80,2,82,2],[83,0,85,0],[83,1,85,1],[83,2,85,2],[74,0,76,0],[74,1,76,1],[74,2,76,2],[77,0,79,0],[77,1,79,1],[77,2,79,2],[68,0,70,0],[68,1,70,1],[68,2,70,2],[71,0,73,0],[71,1,73,1],[71,2,73,2],[62,0,64,0],[62,1,64,1],[62,2,64,2],[65,0,67,0],[65,1,67,1],[65,2,67,2],[56,0,58,0],[56,1,58,1],[56,2,58,2],[59,0,61,0],[59,1,61,1],[59,2,61,2],[50,0,52,0],[50,1,52,1],[50,2,52,2],[53,0,55,0],[53,1,55,1],[53,2,55,2],[44,0,46,0],[44,1,46,1],[44,2,46,2],[47,0,49,0],[47,1,49,1],[47,2,49,2],[38,0,40,0],[38,1,40,1],[38,2,40,2],[41,0,43,0],[41,1,43,1],[41,2,43,2],[32,0,34,0],[32,1,34,1],[32,2,34,2],[35,0,37,0],[35,1,37,1],[35,2,37,2],[26,0,28,0],[26,1,28,1],[26,2,28,2],[29,0,31,0],[29,1,31,1],[29,2,31,2],[20,2,22,2],[23,0,25,0],[23,1,25,1],[23,2,25,2],[14,0,16,0],[14,1,16,1],[14,2,16,2],[17,0,19,0],[17,1,19,1],[17,2,19,2],[148,0,148,2],[0,4,0,10],[0,13,0,17],[1,4,1,5],[1,6,1,7],[1,8,1,9],[1,10,1,11],[1,12,1,13],[1,14,1,15],[1,16,1,17],[8,0,10,0],[8,1,10,1],[8,2,10,2],[11,0,13,0],[11,1,13,1],[11,2,13,2],[2,0,4,0],[2,1,4,1],[2,2,4,2],[5,0,7,0],[5,1,7,1],[5,2,7,2],[20,0,22,0],[20,1,22,1]]}
[null,"The 15 Minute Fix: SENSES","Workout Title:    _________________________________",null,"________________________",null,null,null,null,null,null,"Week of: ___________________",null,"________________"]
["Exercise",null,"Times/Day",null,"Sun",null,"Mon",null,"Tue",null,"Wed",null,"Thus",null,"Fri",null,"Sat"]
[{"$f":"INDIRECT(\"Input!A\"&$U3)","v":1},{"$f":"INDIRECT(\"Input!B\"&$U3)","v":"5x5 Warm Up"},{"$f":"INDIRECT(\"Input!C\"&$U3)","v":1},"Time E/A*",{"$f":"IF(INDIRECT(\"Input!D\"&U3)=\"yes\",VLOOKUP($B3,Input!$L$3:$N$54,3,FALSE)*C3,0)","v":0},null,{"$f":"IF(INDIRECT(\"Input!E\"&U3)=\"yes\",VLOOKUP($B3,Input!$L$3:$N$54,3,FALSE)*C3,0)","v":3},null,{"$f":"IF(INDIRECT(\"Input!f\"&U3)=\"yes\",VLOOKUP($B3,Input!$L$3:$N$54,3,FALSE)*C3,0)","v":0},null,{"$f":"IF(INDIRECT(\"Input!g\"&U3)=\"yes\",VLOOKUP($B3,Input!$L$3:$N$54,3,FALSE)*C3,0)","v":3},null,{"$f":"IF(INDIRECT(\"Input!h\"&U3)=\"yes\",VLOOKUP($B3,Input!$L$3:$N$54,3,FALSE)*C3,0)","v":0},null,{"$f":"IF(INDIRECT(\"Input!i\"&U3)=\"yes\",VLOOKUP($B3,Input!$L$3:$N$54,3,FALSE)*C3,0)","v":3},null,{"$f":"IF(INDIRECT(\"Input!j\"&U3)=\"yes\",VLOOKUP($B3,Input!$L$3:$N$54,3,FALSE)*C3,0)","v":0},null,null,null,3]
[null,null,null,"Reps/Sets"]
[null,null,null,"Notes"]
[{"$f":"INDIRECT(\"Input!A\"&$U6)","v":3},{"$f":"INDIRECT(\"Input!B\"&$U6)","v":"Elementary Listening"},{"$f":"INDIRECT(\"Input!C\"&$U6)","v":1},"Time E/A",{"$f":"IF(INDIRECT(\"Input!D\"&U6)=\"yes\",VLOOKUP($B6,Input!$L$3:$N$54,3,FALSE)*C6,0)","v":0},null,{"$f":"IF(INDIRECT(\"Input!E\"&U6)=\"yes\",VLOOKUP($B6,Input!$L$3:$N$54,3,FALSE)*C6,0)","v":0},null,{"$f":"IF(INDIRECT(\"Input!f\"&U6)=\"yes\",VLOOKUP($B6,Input!$L$3:$N$54,3,FALSE)*C6,0)","v":3},null,{"$f":"IF(INDIRECT(\"Input!g\"&U6)=\"yes\",VLOOKUP($B6,Input!$L$3:$N$54,3,FALSE)*C6,0)","v":0},null,{"$f":"IF(INDIRECT(\"Input!h\"&U6)=\"yes\",VLOOKUP($B6,Input!$L$3:$N$54,3,FALSE)*C6,0)","v":3},null,{"$f":"IF(INDIRECT(\"Input!i\"&U6)=\"yes\",VLOOKUP($B6,Input!$L$3:$N$54,3,FALSE)*C6,0)","v":0},null,{"$f":"IF(INDIRECT(\"Input!j\"&U6)=\"yes\",VLOOKUP($B6,Input!$L$3:$N$54,3,FALSE)*C6,0)","v":0},null,null,{"$f":"IF(A6=\"\",1,2)","v":2},{"$f":"U3+1","v":4}]
[null,null,null,"Reps/Sets",null,null,null,null,null,null,null,null,null,null,null,null,null,null,null,{"$f":"IF(A6=\"\",1,2)","v":2}]
[null,null,null,"Notes",null,null,null,null,null,null,null,null,null,null,null,null,null,null,null,{"$f":"IF(A6=\"\",1,2)","v":2}]
[{"$f":"INDIRECT(\"Input!A\"&$U9)","v":17},{"$f":"INDIRECT(\"Input!B\"&$U9)","v":"Distinct Smell Awareness"},{"$f":"INDIRECT(\"Input!C\"&$U9)","v":1},"Time E/A",{"$f":"IF(INDIRECT(\"Input!D\"&U9)=\"yes\",VLOOKUP($B9,Input!$L$3:$N$54,3,FALSE)*C9,0)","v":2},null,{"$f":"IF(INDIRECT(\"Input!E\"&U9)=\"yes\",VLOOKUP($B9,Input!$L$3:$N$54,3,FALSE)*C9,0)","v":0},null,{"$f":"IF(INDIRECT(\"Input!f\"&U9)=\"yes\",VLOOKUP($B9,Input!$L$3:$N$54,3,FALSE)*C9,0)","v":0},null,{"$f":"IF(INDIRECT(\"Input!g\"&U9)=\"yes\",VLOOKUP($B9,Input!$L$3:$N$54,3,FALSE)*C9,0)","v":2},null,{"$f":"IF(INDIRECT(\"Input!h\"&U9)=\"yes\",VLOOKUP($B9,Input!$L$3:$N$54,3,FALSE)*C9,0)","v":0},null,{"$f":"IF(INDIRECT(\"Input!i\"&U9)=\"yes\",VLOOKUP($B9,Input!$L$3:$N$54,3,FALSE)*C9,0)","v":0},null,{"$f":"IF(INDIRECT(\"Input!j\"&U9)=\"yes\",VLOOKUP($B9,Input!$L$3:$N$54,3,FALSE)*C9,0)","v":2},null,null,{"$f":"IF(A9=\"\",1,2)","v":2},{"$f":"U6+1","v":5}]
[null,null,null,"Reps/Sets",null,null,null,null,null,null,null,null,null,null,null,null,null,null,null,{"$f":"IF(A9=\"\",1,2)","v":2}]
[null,null,null,"Notes",null,null,null,null,null,null,null,null,null,null,null,null,null,null,null,{"$f":"IF(A9=\"\",1,2)","v":2}]
[{"$f":"INDIRECT(\"Input!A\"&$U12)","v":25},{"$f":"INDIRECT(\"Input!B\"&$U12)","v":"Taste Comprehension"},{"$f":"INDIRECT(\"Input!C\"&$U12)","v":1},"Time E/A",{"$f":"IF(INDIRECT(\"Input!D\"&U12)=\"yes\",VLOOKUP($B12,Input!$L$3:$N$54,3,FALSE)*C12,0)","v":0},null,{"$f":"IF(INDIRECT(\"Input!E\"&U12)=\"yes\",VLOOKUP($B12,Input!$L$3:$N$54,3,FALSE)*C12,0)","v":2},null,{"$f":"IF(INDIRECT(\"Input!f\"&U12)=\"yes\",VLOOKUP($B12,Input!$L$3:$N$54,3,FALSE)*C12,0)","v":0},null,{"$f":"IF(INDIRECT(\"Input!g\"&U12)=\"yes\",VLOOKUP($B12,Input!$L$3:$N$54,3,FALSE)*C12,0)","v":2},null,{"$f":"IF(INDIRECT(\"Input!h\"&U12)=\"yes\",VLOOKUP($B12,Input!$L$3:$N$54,3,FALSE)*C12,0)","v":0},null,{"$f":"IF(INDIRECT(\"Input!i\"&U12)=\"yes\",VLOOKUP($B12,Input!$L$3:$N$54,3,FALSE)*C12,0)","v":2},null,{"$f":"IF(INDIRECT(\"Input!j\"&U12)=\"yes\",VLOOKUP($B12,Input!$L$3:$N$54,3,FALSE)*C12,0)","v":0},null,null,{"$f":"IF(A12=\"\",1,2)","v":2},{"$f":"U9+1","v":6}]
[null,null,null,"Reps/Sets",null,null,null,null,null,null,null,null,null,null,null,null,null,null,null,{"$f":"IF(A12=\"\",1,2)","v":2}]
[null,null,null,"Notes",null,null,null,null,null,null,null,null,null,null,null,null,null,null,null,{"$f":"IF(A12=\"\",1,2)","v":2}]
[{"$f":"INDIRECT(\"Input!A\"&$U15)","v":35},{"$f":"INDIRECT(\"Input!B\"&$U15)","v":"Hand Exploration"},{"$f":"INDIRECT(\"Input!C\"&$U15)","v":1},"Time E/A",{"$f":"IF(INDIRECT(\"Input!D\"&U15)=\"yes\",VLOOKUP($B15,Input!$L$3:$N$54,3,FALSE)*C15,0)","v":0},null,{"$f":"IF(INDIRECT(\"Input!E\"&U15)=\"yes\",VLOOKUP($B15,Input!$L$3:$N$54,3,FALSE)*C15,0)","v":0},null,{"$f":"IF(INDIRECT(\"Input!f\"&U15)=\"yes\",VLOOKUP($B15,Input!$L$3:$N$54,3,FALSE)*C15,0)","v":4},null,{"$f":"IF(INDIRECT(\"Input!g\"&U15)=\"yes\",VLOOKUP($B15,Input!$L$3:$N$54,3,FALSE)*C15,0)","v":0},null,{"$f":"IF(INDIRECT(\"Input!h\"&U15)=\"yes\",VLOOKUP($B15,Input!$L$3:$N$54,3,FALSE)*C15,0)","v":4},null,{"$f":"IF(INDIRECT(\"Input!i\"&U15)=\"yes\",VLOOKUP($B15,Input!$L$3:$N$54,3,FALSE)*C15,0)","v":0},null,{"$f":"IF(INDIRECT(\"Input!j\"&U15)=\"yes\",VLOOKUP($B15,Input!$L$3:$N$54,3,FALSE)*C15,0)","v":0},null,null,{"$f":"IF(A15=\"\",1,2)","v":2},{"$f":"U12+1","v":7}]
[null,null,null,"Reps/Sets",null,null,null,null,null,null,null,null,null,null,null,null,null,null,null,{"$f":"IF(A15=\"\",1,2)","v":2}]
[null,null,null,"Notes",null,null,null,null,null,null,null,null,null,null,null,null,null,null,null,{"$f":"IF(A15=\"\",1,2)","v":2}]
[{"$f":"INDIRECT(\"Input!A\"&$U18)","v":""},{"$f":"INDIRECT(\"Input!B\"&$U18)","v":0},{"$f":"INDIRECT(\"Input!C\"&$U18)","v":1},"Time E/A",{"$f":"IF(INDIRECT(\"Input!D\"&U18)=\"yes\",VLOOKUP($B18,Input!$L$3:$N$54,3,FALSE)*C18,0)","v":0},null,{"$f":"IF(INDIRECT(\"Input!E\"&U18)=\"yes\",VLOOKUP($B18,Input!$L$3:$N$54,3,FALSE)*C18,0)","v":0},null,{"$f":"IF(INDIRECT(\"Input!f\"&U18)=\"yes\",VLOOKUP($B18,Input!$L$3:$N$54,3,FALSE)*C18,0)","v":0},null,{"$f":"IF(INDIRECT(\"Input!g\"&U18)=\"yes\",VLOOKUP($B18,Input!$L$3:$N$54,3,FALSE)*C18,0)","v":0},null,{"$f":"IF(INDIRECT(\"Input!h\"&U18)=\"yes\",VLOOKUP($B18,Input!$L$3:$N$54,3,FALSE)*C18,0)","v":0},null,{"$f":"IF(INDIRECT(\"Input!i\"&U18)=\"yes\",VLOOKUP($B18,Input!$L$3:$N$54,3,FALSE)*C18,0)","v":0},null,{"$f":"IF(INDIRECT(\"Input!j\"&U18)=\"yes\",VLOOKUP($B18,Input!$L$3:$N$54,3,FALSE)*C18,0)","v":0},null,null,{"$f":"IF(A18=\"\",1,2)","v":1},{"$f":"U15+1","v":8}]
[null,null,null,"Reps/Sets",null,null,null,null,null,null,null,null,null,null,null,null,null,null,null,{"$f":"IF(A18=\"\",1,2)","v":1}]
[null,null,null,"Notes",null,null,null,null,null,null,null,null,null,null,null,null,null,null,null,{"$f":"IF(A18=\"\",1,2)","v":1}]
[{"$f":"INDIRECT(\"Input!A\"&$U21)","v":""},{"$f":"INDIRECT(\"Input!B\"&$U21)","v":0},{"$f":"INDIRECT(\"Input!C\"&$U21)","v":1},"Time E/A",{"$f":"IF(INDIRECT(\"Input!D\"&U21)=\"yes\",VLOOKUP($B21,Input!$L$3:$N$54,3,FALSE)*C21,0)","v":0},null,{"$f":"IF(INDIRECT(\"Input!E\"&U21)=\"yes\",VLOOKUP($B21,Input!$L$3:$N$54,3,FALSE)*C21,0)","v":0},null,{"$f":"IF(INDIRECT(\"Input!f\"&U21)=\"yes\",VLOOKUP($B21,Input!$L$3:$N$54,3,FALSE)*C21,0)","v":0},null,{"$f":"IF(INDIRECT(\"Input!g\"&U21)=\"yes\",VLOOKUP($B21,Input!$L$3:$N$54,3,FALSE)*C21,0)","v":0},null,{"$f":"IF(INDIRECT(\"Input!h\"&U21)=\"yes\",VLOOKUP($B21,Input!$L$3:$N$54,3,FALSE)*C21,0)","v":0},null,{"$f":"IF(INDIRECT(\"Input!i\"&U21)=\"yes\",VLOOKUP($B21,Input!$L$3:$N$54,3,FALSE)*C21,0)","v":0},null,{"$f":"IF(INDIRECT(\"Input!j\"&U21)=\"yes\",VLOOKUP($B21,Input!$L$3:$N$54,3,FALSE)*C21,0)","v":0},null,null,{"$f":"IF(A21=\"\",1,2)","v":1},{"$f":"U18+1","v":9}]
[null,null,null,"Reps/Sets",null,null,null,null,null,null,null,null,null,null,null,null,null,null,null,{"$f":"IF(A21=\"\",1,2)","v":1}]
[null,null,null,"Notes",null,null,null,null,null,null,null,null,null,null,null,null,null,null,null,{"$f":"IF(A21=\"\",1,2)","v":1}]
[{"$f":"INDIRECT(\"Input!A\"&$U24)","v":""},{"$f":"INDIRECT(\"Input!B\"&$U24)","v":0},{"$f":"INDIRECT(\"Input!C\"&$U24)","v":1},"Time E/A",{"$f":"IF(INDIRECT(\"Input!D\"&U24)=\"yes\",VLOOKUP($B24,Input!$L$3:$N$54,3,FALSE)*C24,0)","v":0},null,{"$f":"IF(INDIRECT(\"Input!E\"&U24)=\"yes\",VLOOKUP($B24,Input!$L$3:$N$54,3,FALSE)*C24,0)","v":0},null,{"$f":"IF(INDIRECT(\"Input!f\"&U24)=\"yes\",VLOOKUP($B24,Input!$L$3:$N$54,3,FALSE)*C24,0)","v":0},null,{"$f":"IF(INDIRECT(\"Input!g\"&U24)=\"yes\",VLOOKUP($B24,Input!$L$3:$N$54,3,FALSE)*C24,0)","v":0},null,{"$f":"IF(INDIRECT(\"Input!h\"&U24)=\"yes\",VLOOKUP($B24,Input!$L$3:$N$54,3,FALSE)*C24,0)","v":0},null,{"$f":"IF(INDIRECT(\"Input!i\"&U24)=\"yes\",VLOOKUP($B24,Input!$L$3:$N$54,3,FALSE)*C24,0)","v":0},null,{"$f":"IF(INDIRECT(\"Input!j\"&U24)=\"yes\",VLOOKUP($B24,Input!$L$3:$N$54,3,FALSE)*C24,0)","v":0},null,null,{"$f":"IF(A24=\"\",1,2)","v":1},{"$f":"U21+1","v":10}]
[null,null,null,"Reps/Sets",null,null,null,null,null,null,null,null,null,null,null,null,null,null,null,{"$f":"IF(A24=\"\",1,2)","v":1}]
[null,null,null,"Notes",null,null,null,null,null,null,null,null,null,null,null,null,null,null,null,{"$f":"IF(A24=\"\",1,2)","v":1}]
[{"$f":"INDIRECT(\"Input!A\"&$U27)","v":""},{"$f":"INDIRECT(\"Input!B\"&$U27)","v":0},{"$f":"INDIRECT(\"Input!C\"&$U27)","v":1},"Time E/A",{"$f":"IF(INDIRECT(\"Input!D\"&U27)=\"yes\",VLOOKUP($B27,Input!$L$3:$N$54,3,FALSE)*C27,0)","v":0},null,{"$f":"IF(INDIRECT(\"Input!E\"&U27)=\"yes\",VLOOKUP($B27,Input!$L$3:$N$54,3,FALSE)*C27,0)","v":0},null,{"$f":"IF(INDIRECT(\"Input!f\"&U27)=\"yes\",VLOOKUP($B27,Input!$L$3:$N$54,3,FALSE)*C27,0)","v":0},null,{"$f":"IF(INDIRECT(\"Input!g\"&U27)=\"yes\",VLOOKUP($B27,Input!$L$3:$N$54,3,FALSE)*C27,0)","v":0},null,{"$f":"IF(INDIRECT(\"Input!h\"&U27)=\"yes\",VLOOKUP($B27,Input!$L$3:$N$54,3,FALSE)*C27,0)","v":0},null,{"$f":"IF(INDIRECT(\"Input!i\"&U27)=\"yes\",VLOOKUP($B27,Input!$L$3:$N$54,3,FALSE)*C27,0)","v":0},null,{"$f":"IF(INDIRECT(\"Input!j\"&U27)=\"yes\",VLOOKUP($B27,Input!$L$3:$N$54,3,FALSE)*C27,0)","v":0},null,null,{"$f":"IF(A27=\"\",1,2)","v":1},{"$f":"U24+1","v":11}]
[null,null,null,"Reps/Sets",null,null,null,null,null,null,null,null,null,null,null,null,null,null,null,{"$f":"IF(A27=\"\",1,2)","v":1}]
[null,null,null,"Notes",null,null,null,null,null,null,null,null,null,null,null,null,null,null,null,{"$f":"IF(A27=\"\",1,2)","v":1}]
[{"$f":"INDIRECT(\"Input!A\"&$U30)","v":""},{"$f":"INDIRECT(\"Input!B\"&$U30)","v":0},{"$f":"INDIRECT(\"Input!C\"&$U30)","v":1},"Time E/A",{"$f":"IF(INDIRECT(\"Input!D\"&U30)=\"yes\",VLOOKUP($B30,Input!$L$3:$N$54,3,FALSE)*C30,0)","v":0},null,{"$f":"IF(INDIRECT(\"Input!E\"&U30)=\"yes\",VLOOKUP($B30,Input!$L$3:$N$54,3,FALSE)*C30,0)","v":0},null,{"$f":"IF(INDIRECT(\"Input!f\"&U30)=\"yes\",VLOOKUP($B30,Input!$L$3:$N$54,3,FALSE)*C30,0)","v":0},null,{"$f":"IF(INDIRECT(\"Input!g\"&U30)=\"yes\",VLOOKUP($B30,Input!$L$3:$N$54,3,FALSE)*C30,0)","v":0},null,{"$f":"IF(INDIRECT(\"Input!h\"&U30)=\"yes\",VLOOKUP($B30,Input!$L$3:$N$54,3,FALSE)*C30,0)","v":0},null,{"$f":"IF(INDIRECT(\"Input!i\"&U30)=\"yes\",VLOOKUP($B30,Input!$L$3:$N$54,3,FALSE)*C30,0)","v":0},null,{"$f":"IF(INDIRECT(\"Input!j\"&U30)=\"yes\",VLOOKUP($B30,Input!$L$3:$N$54,3,FALSE)*C30,0)","v":0},null,null,{"$f":"IF(A30=\"\",1,2)","v":1},{"$f":"U27+1","v":12}]
[null,null,null,"Reps/Sets",null,null,null,null,null,null,null,null,null,null,null,null,null,null,null,{"$f":"IF(A30=\"\",1,2)","v":1}]
[null,null,null,"Notes",null,null,null,null,null,null,null,null,null,null,null,null,null,null,null,{"$f":"IF(A30=\"\",1,2)","v":1}]
[{"$f":"INDIRECT(\"Input!A\"&$U33)","v":""},{"$f":"INDIRECT(\"Input!B\"&$U33)","v":0},{"$f":"INDIRECT(\"Input!C\"&$U33)","v":1},"Time E/A",{"$f":"IF(INDIRECT(\"Input!D\"&U33)=\"yes\",VLOOKUP($B33,Input!$L$3:$N$54,3,FALSE)*C33,0)","v":0},null,{"$f":"IF(INDIRECT(\"Input!E\"&U33)=\"yes\",VLOOKUP($B33,Input!$L$3:$N$54,3,FALSE)*C33,0)","v":0},null,{"$f":"IF(INDIRECT(\"Input!f\"&U33)=\"yes\",VLOOKUP($B33,Input!$L$3:$N$54,3,FALSE)*C33,0)","v":0},null,{"$f":"IF(INDIRECT(\"Input!g\"&U33)=\"yes\",VLOOKUP($B33,Input!$L$3:$N$54,3,FALSE)*C33,0)","v":0},null,{"$f":"IF(INDIRECT(\"Input!h\"&U33)=\"yes\",VLOOKUP($B33,Input!$L$3:$N$54,3,FALSE)*C33,0)","v":0},null,{"$f":"IF(INDIRECT(\"Input!i\"&U33)=\"yes\",VLOOKUP($B33,Input!$L$3:$N$54,3,FALSE)*C33,0)","v":0},null,{"$f":"IF(INDIRECT(\"Input!j\"&U33)=\"yes\",VLOOKUP($B33,Input!$L$3:$N$54,3,FALSE)*C33,0)","v":0},null,null,{"$f":"IF(A33=\"\",1,2)","v":1},{"$f":"U30+1","v":13}]
[null,null,null,"Reps/Sets",null,null,null,null,null,null,null,null,null,null,null,null,null,null,null,{"$f":"IF(A33=\"\",1,2)","v":1}]
[null,null,null,"Notes",null,null,null,null,null,null,null,null,null,null,null,null,null,null,null,{"$f":"IF(A33=\"\",1,2)","v":1}]
[{"$f":"INDIRECT(\"Input!A\"&$U36)","v":""},{"$f":"INDIRECT(\"Input!B\"&$U36)","v":0},{"$f":"INDIRECT(\"Input!C\"&$U36)","v":1},"Time E/A",{"$f":"IF(INDIRECT(\"Input!D\"&U36)=\"yes\",VLOOKUP($B36,Input!$L$3:$N$54,3,FALSE)*C36,0)","v":0},null,{"$f":"IF(INDIRECT(\"Input!E\"&U36)=\"yes\",VLOOKUP($B36,Input!$L$3:$N$54,3,FALSE)*C36,0)","v":0},null,{"$f":"IF(INDIRECT(\"Input!f\"&U36)=\"yes\",VLOOKUP($B36,Input!$L$3:$N$54,3,FALSE)*C36,0)","v":0},null,{"$f":"IF(INDIRECT(\"Input!g\"&U36)=\"yes\",VLOOKUP($B36,Input!$L$3:$N$54,3,FALSE)*C36,0)","v":0},null,{"$f":"IF(INDIRECT(\"Input!h\"&U36)=\"yes\",VLOOKUP($B36,Input!$L$3:$N$54,3,FALSE)*C36,0)","v":0},null,{"$f":"IF(INDIRECT(\"Input!i\"&U36)=\"yes\",VLOOKUP($B36,Input!$L$3:$N$54,3,FALSE)*C36,0)","v":0},null,{"$f":"IF(INDIRECT(\"Input!j\"&U36)=\"yes\",VLOOKUP($B36,Input!$L$3:$N$54,3,FALSE)*C36,0)","v":0},null,null,{"$f":"IF(A36=\"\",1,2)","v":1},{"$f":"U33+1","v":14}]
[null,null,null,"Reps/Sets",null,null,null,null,null,null,null,null,null,null,null,null,null,null,null,{"$f":"IF(A36=\"\",1,2)","v":1}]
[null,null,null,"Notes",null,null,null,null,null,null,null,null,null,null,null,null,null,null,null,{"$f":"IF(A36=\"\",1,2)","v":1}]
[{"$f":"INDIRECT(\"Input!A\"&$U39)","v":""},{"$f":"INDIRECT(\"Input!B\"&$U39)","v":0},{"$f":"INDIRECT(\"Input!C\"&$U39)","v":1},"Time E/A",{"$f":"IF(INDIRECT(\"Input!D\"&U39)=\"yes\",VLOOKUP($B39,Input!$L$3:$N$54,3,FALSE)*C39,0)","v":0},null,{"$f":"IF(INDIRECT(\"Input!E\"&U39)=\"yes\",VLOOKUP($B39,Input!$L$3:$N$54,3,FALSE)*C39,0)","v":0},null,{"$f":"IF(INDIRECT(\"Input!f\"&U39)=\"yes\",VLOOKUP($B39,Input!$L$3:$N$54,3,FALSE)*C39,0)","v":0},null,{"$f":"IF(INDIRECT(\"Input!g\"&U39)=\"yes\",VLOOKUP($B39,Input!$L$3:$N$54,3,FALSE)*C39,0)","v":0},null,{"$f":"IF(INDIRECT(\"Input!h\"&U39)=\"yes\",VLOOKUP($B39,Input!$L$3:$N$54,3,FALSE)*C39,0)","v":0},null,{"$f":"IF(INDIRECT(\"Input!i\"&U39)=\"yes\",VLOOKUP($B39,Input!$L$3:$N$54,3,FALSE)*C39,0)","v":0},null,{"$f":"IF(INDIRECT(\"Input!j\"&U39)=\"yes\",VLOOKUP($B39,Input!$L$3:$N$54,3,FALSE)*C39,0)","v":0},null,null,{"$f":"IF(A39=\"\",1,2)","v":1},{"$f":"U36+1","v":15}]
[null,null,null,"Reps/Sets",null,null,null,null,null,null,null,null,null,null,null,null,null,null,null,{"$f":"IF(A39=\"\",1,2)","v":1}]
{"$rows_left_out":109}